{"text_format":"1","workbook":"xlsx","n_sheets":6,"sheets":["これをコピー","1","2","3","教科担任に確認","名簿"],"not_rendered":{"charts":0,"images":0,"macros":1,"external_links":0,"defined_names":13,"comments":2,"pivot_tables":0},"unopened":[],"bounds":{"document_bytes":16777216,"sheet_cells":100000,"rows_first":2000,"rows_last":500,"rows_between":2000,"halvings":0,"cell_chars":16384,"cell_head_chars":4096},"cells_cut":0,"cells_raw":0,"read":"whole","date_system":"1900"}

{"sheet":"これをコピー","index":0,"n_rows":68,"n_cols":21,"rows_kept":68,"cut":false,"hidden":false,"merged":[[54,2,54,4],[55,3,55,4],[56,3,56,4],[57,3,57,4],[58,3,58,4],[53,2,53,4],[0,3,0,4],[49,2,49,4],[50,2,50,4],[51,2,51,4],[52,2,52,4]]}
[null,null,8,{"$f":"VLOOKUP(C1,名簿!A:B,2,0)","v":"山内 宏"},"爲國　紋白",{"$f":"教科担任に確認!Z3","v":"現代文"},"古典",{"$f":"教科担任に確認!Z5","v":"政治経済"},{"$f":"教科担任に確認!Z6","v":"地理B"},{"$f":"教科担任に確認!Z7","v":"数学Ⅲ"},{"$f":"教科担任に確認!Z8","v":"数学１"},{"$f":"教科担任に確認!Z9","v":"数学２"},{"$f":"教科担任に確認!Z10","v":"物理"},{"$f":"教科担任に確認!Z11","v":"化学"},{"$f":"教科担任に確認!Z12","v":"コミュ"},{"$f":"教科担任に確認!Z13","v":"表現"},{"$f":"教科担任に確認!Z14","v":"体育"},{"$f":"教科担任に確認!Z15","v":"総合"},{"$f":"教科担任に確認!Z16","v":"HR"},"合計"]
[null,null,"日","曜日","理由",{"$f":"教科担任に確認!AA3","v":2},{"$f":"教科担任に確認!AA4","v":2},{"$f":"教科担任に確認!AA5","v":2},{"$f":"教科担任に確認!AA6","v":2},{"$f":"教科担任に確認!AA7","v":4},{"$f":"教科担任に確認!AA8","v":2},{"$f":"教科担任に確認!AA9","v":2},{"$f":"教科担任に確認!AA10","v":4},{"$f":"教科担任に確認!AA11","v":4},{"$f":"教科担任に確認!AA12","v":4},{"$f":"教科担任に確認!AA13","v":3},{"$f":"教科担任に確認!AA14","v":2},{"$f":"教科担任に確認!AA15","v":1},{"$f":"教科担任に確認!AA16","v":1},{"$f":"SUM(F2:S2)","v":35},"備考"]
[{"$f":"ROW()-2","v":1},1,"2022-04-12",{"$f":"IF(ISBLANK(C3),\"\",C3)","v":44663},null,null,null,null,1,1,null,null,1,1,1,1,1,null,null,{"$f":"IF(SUM(F3:T3)=0,\"\",SUM(F3:T3))","v":0}]
[2,1,"2022-05-23",44704,null,1,null,1,null,1,1,null,1,1,1,null,null,null,null,0]
[3,1,"2022-05-27",44708,null,1,null,1,null,1,null,1,null,1,1,null,null,1,null,0]
[4,1,"2022-05-30",44711,null,1,null,1,null,1,1,null,1,1,1,null,null,null,null,0]
[5,1,"2022-06-01",44713,"早退",null,null,null,null,null,1,null,1,null,null,1,null,null,null,0]
[6,1,"2022-06-02",44714,null,null,1,null,null,1,null,null,1,1,null,1,1,null,1,0]
[7,1,"2022-06-03",44715,null,1,null,1,null,1,null,1,null,1,1,null,null,1,null,0]
[8,1,"2022-06-07",44719,null,null,null,null,1,1,null,null,1,1,1,1,1,null,null,0]
[9,1,"2022-06-08",44720,null,null,1,null,1,null,1,1,1,null,1,1,null,null,null,0]
[10,1,"2022-06-10",44722,null,1,null,1,null,1,null,1,null,1,1,null,null,1,null,0]
[11,1,"2022-06-13",44725,null,1,null,1,null,1,1,null,1,1,1,null,null,null,null,0]
[12,1,"2022-06-14",44726,null,null,null,null,1,1,null,null,1,1,1,1,1,null,null,0]
[13,1,"2022-06-15",44727,null,null,1,null,1,null,1,1,1,null,1,1,null,null,null,0]
[14,1,"2022-06-16",44728,null,null,1,null,null,1,null,null,1,1,null,1,1,null,1,0]
[15,1,"2022-06-17",44729,null,1,null,1,null,1,null,1,null,1,1,null,null,1,null,0]
[16,1,"2022-06-20",44732,"早退",null,null,null,null,1,null,null,1,null,1,null,null,null,null,0]
[17,1,"2022-06-21",44733,null,null,null,null,1,null,null,1,1,1,1,1,1,null,null,0]
[18,1,"2022-06-22",44734,null,null,1,null,1,1,1,null,1,null,1,1,null,null,null,0]
[19,1,"2022-06-27",44739,null,1,null,1,null,1,1,null,1,1,1,null,null,null,null,0]
[20,2,"2022-07-19",44761,null,null,null,null,null,1,null,null,1,null,null,1,1,null,null,0]
[21,2,"2022-08-17",{"$f":"IF(ISBLANK(C23),\"\",C23)","v":44790},null,null,null,null,null,null,null,null,null,null,null,null,null,null,null,{"$f":"IF(SUM(F23:S23)=0,\"\",SUM(F23:S23))","v":""},"出校日"]
[22,2,"2022-09-02",44806,null,null,1,1,null,3,null,null,null,1,1,null,null,null,null,7]
[23,2,"2022-09-06",44810,null,null,null,null,1,1,null,null,1,1,null,1,1,null,1,7]
[24,2,"2022-09-16",44820,null,1,null,1,null,1,null,1,null,1,1,null,null,1,null,7]
[25,2,"2022-10-03",44837,null,1,null,1,null,1,1,null,1,1,1,null,null,null,null,7]
[26,2,"2022-10-04",44838,null,null,null,null,1,1,null,null,1,1,1,1,1,null,null,7]
[27,2,"2022-10-05",44839,null,null,1,null,1,null,1,1,1,null,1,1,null,null,null,7]
[28,2,"2022-10-12",44846,null,null,1,null,1,null,1,1,1,null,1,1,null,null,null,7]
[29,2,"2022-10-21",44855,"早退",null,null,null,null,1,null,null,null,null,null,null,null,1,null,2]
[30,2,"2022-10-24",44858,null,1,null,1,null,1,1,null,1,1,1,null,null,null,null,7]
[31,2,"2022-10-25",44859,null,null,null,null,1,1,null,null,1,1,1,1,1,null,null,7]
[32,2,"2022-10-26",44860,null,null,1,null,1,null,1,1,1,1,1,null,null,null,null,7]
[33,2,"2022-10-27",44861,null,null,1,null,null,1,null,null,1,1,null,1,1,null,1,{"$f":"IF(SUM(F35:S35)=0,\"\",SUM(F35:S35))","v":7}]
[34,2,"2022-11-02",44867,null,null,1,null,1,null,1,1,1,null,1,1,null,null,null,7]
[35,2,"2022-11-07",44872,null,1,null,1,null,1,1,null,1,1,1,null,null,null,null,7]
[36,2,"2022-11-08",44873,null,1,null,null,1,null,null,null,1,1,1,1,1,null,null,7]
[37,2,"2022-11-09",44874,null,null,1,null,1,1,null,1,1,null,1,1,null,null,null,7]
[38,2,"2022-11-10",44875,null,null,1,null,null,1,null,null,1,1,null,1,1,null,1,7]
{"$rows_left_out":29}
{"sheet":"1","index":1,"n_rows":69,"n_cols":21,"rows_kept":69,"cut":false,"hidden":false,"merged":[[55,2,55,4],[56,3,56,4],[57,3,57,4],[58,3,58,4],[59,3,59,4],[54,2,54,4],[0,3,0,4],[50,2,50,4],[51,2,51,4],[52,2,52,4],[53,2,53,4]]}
[null,null,1,{"$f":"VLOOKUP(C1,名簿!A:B,2,0)","v":"松本 太一"},"爲國　紋白","現代文","古典","政治経済","地理B","数学Ⅲ","数学１","数学２","物理","化学","コミュ","表現","体育","総合","HR","合計"]
[null,null,"日","曜日","理由",{"$f":"教科担任に確認!AA3","v":2},{"$f":"教科担任に確認!AA4","v":2},{"$f":"教科担任に確認!AA5","v":2},{"$f":"教科担任に確認!AA6","v":2},{"$f":"教科担任に確認!AA7","v":4},{"$f":"教科担任に確認!AA8","v":2},{"$f":"教科担任に確認!AA9","v":2},{"$f":"教科担任に確認!AA10","v":4},{"$f":"教科担任に確認!AA11","v":4},{"$f":"教科担任に確認!AA12","v":4},{"$f":"教科担任に確認!AA13","v":3},{"$f":"教科担任に確認!AA14","v":2},{"$f":"教科担任に確認!AA15","v":1},{"$f":"教科担任に確認!AA16","v":1},{"$f":"SUM(F2:S2)","v":35},"備考"]
[{"$f":"ROW()-2","v":1},1,"2022-04-12",{"$f":"IF(ISBLANK(C3),\"\",C3)","v":44663},null,null,null,null,1,1,null,null,1,1,1,1,1,null,null,{"$f":"IF(SUM(F3:S3)=0,\"\",SUM(F3:S3))","v":7}]
[2,1,"2022-05-23",44704,null,1,null,1,null,1,1,null,1,1,1,null,null,null,null,7]
[3,1,"2022-05-27",44708,null,1,null,1,null,1,null,1,null,1,1,null,null,1,null,7]
[4,1,"2022-05-30",{"$f":"IF(ISBLANK(C6),\"\",C6)","v":44711},null,1,null,1,null,1,1,null,1,1,1,null,null,null,null,7]
[5,1,"2022-06-01",44713,"早退",null,null,null,null,null,1,null,1,null,null,1,null,null,null,3]
[6,1,"2022-06-02",44714,null,null,1,null,null,1,null,null,1,1,null,1,1,null,1,7]
[7,1,"2022-06-03",44715,null,1,null,1,null,1,null,1,null,1,1,null,null,1,null,7]
[8,1,"2022-06-07",44719,null,null,null,null,1,1,null,null,1,1,1,1,1,null,null,7]
[9,1,"2022-06-08",44720,null,null,1,null,1,null,1,1,1,null,1,1,null,null,null,7]
[10,1,"2022-06-10",{"$f":"IF(ISBLANK(C12),\"\",C12)","v":44722},null,1,null,1,null,1,null,1,null,1,1,null,null,1,null,7]
[11,1,"2022-06-13",44725,null,1,null,1,null,1,1,null,1,1,1,null,null,null,null,7]
[12,1,"2022-06-14",44726,null,null,null,null,1,1,null,null,1,1,1,1,1,null,null,7]
[13,1,"2022-06-15",{"$f":"IF(ISBLANK(C15),\"\",C15)","v":44727},null,null,1,null,1,null,1,1,1,null,1,1,null,null,null,7]
[14,1,"2022-06-16",44728,null,null,1,null,null,1,null,null,1,1,null,1,1,null,1,7]
[15,1,"2022-06-17",44729,null,1,null,1,null,1,null,1,null,1,1,null,null,1,null,7]
[16,1,"2022-06-20",44732,"早退",null,null,null,null,1,null,null,1,null,1,null,null,null,null,3]
[17,1,"2022-06-21",{"$f":"IF(ISBLANK(C19),\"\",C19)","v":44733},null,null,null,null,1,null,null,1,1,1,1,1,1,null,null,7]
[18,1,"2022-06-22",44734,null,null,1,null,1,1,1,null,1,null,1,1,null,null,null,7]
[19,1,"2022-06-27",44739,null,1,null,1,null,1,1,null,1,1,1,null,null,null,null,7]
[20,2,"2022-07-19",44761,null,null,null,null,null,1,null,null,1,null,null,1,1,null,null,4]
[21,2,"2022-08-17",44790,null,null,null,null,null,null,null,null,null,null,null,null,null,null,null,""]
[22,2,"2022-09-02",44806,null,null,1,1,null,3,null,null,null,1,1,null,null,null,null,7]
[23,2,"2022-09-06",44810,null,null,null,null,1,1,null,null,1,1,null,1,1,null,1,7]
[24,2,"2022-09-16",{"$f":"IF(ISBLANK(C26),\"\",C26)","v":44820},null,1,null,1,null,1,null,1,null,1,1,null,null,1,null,7]
[25,2,"2022-10-03",44837,null,1,null,1,null,1,1,null,1,1,1,null,null,null,null,7]
[26,2,"2022-10-04",44838,null,null,null,null,1,1,null,null,1,1,1,1,1,null,null,7]
[27,2,"2022-10-05",44839,null,null,1,null,1,null,1,1,1,null,1,1,null,null,null,7]
[28,2,"2022-10-12",{"$f":"IF(ISBLANK(C30),\"\",C30)","v":44846},null,null,1,null,1,null,1,1,1,null,1,1,null,null,null,7]
[29,2,"2022-10-21",44855,"早退",null,null,null,null,1,null,null,null,null,null,null,null,1,null,2]
[30,2,"2022-10-24",{"$f":"IF(ISBLANK(C32),\"\",C32)","v":44858},null,1,null,1,null,1,1,null,1,1,1,null,null,null,null,7]
[31,2,"2022-10-25",44859,null,null,null,null,1,1,null,null,1,1,1,1,1,null,null,7]
[32,2,"2022-10-26",44860,null,null,1,null,1,null,1,1,1,1,1,null,null,null,null,7]
[33,2,"2022-10-27",44861,null,null,1,null,null,1,null,null,1,1,null,1,1,null,1,{"$f":"IF(SUM(F35:S35)=0,\"\",SUM(F35:S35))","v":7}]
[34,2,"2022-11-02",44867,null,null,1,null,1,null,1,1,1,null,1,1,null,null,null,7]
[35,2,"2022-11-07",44872,null,1,null,1,null,1,1,null,1,1,1,null,null,null,null,7]
[36,2,"2022-11-08",44873,null,1,null,null,1,null,null,null,1,1,1,1,1,null,null,7]
[37,2,"2022-11-09",44874,null,null,1,null,1,1,null,1,1,null,1,1,null,null,null,7]
[38,2,"2022-11-10",44875,null,null,1,null,null,1,null,null,1,1,null,1,1,null,1,7]
{"$rows_left_out":30}
{"sheet":"2","index":2,"n_rows":75,"n_cols":21,"rows_kept":75,"cut":false,"hidden":false,"merged":[[61,2,61,4],[62,3,62,4],[63,3,63,4],[64,3,64,4],[65,3,65,4],[60,2,60,4],[0,3,0,4],[56,2,56,4],[57,2,57,4],[58,2,58,4],[59,2,59,4]]}
[null,null,2,{"$f":"VLOOKUP(C1,名簿!A:B,2,0)","v":"田中 元"},"爲國　紋白","現代文","古典","政治経済","地理B","数学Ⅲ","数学１","数学２","物理","化学","コミュ","表現","体育","総合","HR","合計"]
[null,null,"日","曜日","理由",{"$f":"教科担任に確認!AA3","v":2},{"$f":"教科担任に確認!AA4","v":2},{"$f":"教科担任に確認!AA5","v":2},{"$f":"教科担任に確認!AA6","v":2},{"$f":"教科担任に確認!AA7","v":4},{"$f":"教科担任に確認!AA8","v":2},{"$f":"教科担任に確認!AA9","v":2},{"$f":"教科担任に確認!AA10","v":4},{"$f":"教科担任に確認!AA11","v":4},{"$f":"教科担任に確認!AA12","v":4},{"$f":"教科担任に確認!AA13","v":3},{"$f":"教科担任に確認!AA14","v":2},{"$f":"教科担任に確認!AA15","v":1},{"$f":"教科担任に確認!AA16","v":1},{"$f":"SUM(F2:S2)","v":35},"備考"]
[{"$f":"ROW()-2","v":1},1,"2022-04-12",{"$f":"IF(ISBLANK(C3),\"\",C3)","v":44663},null,null,null,null,1,1,null,null,1,1,1,1,1,null,null,{"$f":"IF(SUM(F3:S3)=0,\"\",SUM(F3:S3))","v":7}]
[2,1,"2022-04-13",44664,null,null,1,null,1,1,1,null,1,null,1,1,null,null,null,7]
[3,1,"2022-04-14",44665,null,null,1,null,null,1,null,null,1,1,null,1,1,null,1,7]
[4,1,"2022-04-15",44666,null,1,null,1,null,1,null,1,null,1,1,null,null,1,null,7]
[5,1,"2022-04-18",44669,null,1,null,1,null,null,1,1,1,1,1,null,null,null,null,7]
[6,1,"2022-04-21",44672,"早退",null,null,null,null,null,null,null,null,null,null,null,null,null,1,1]
[7,1,"2022-04-27",44678,null,null,1,null,1,1,1,null,1,null,1,1,null,null,null,7]
[8,1,"2022-04-28",44679,null,null,1,null,null,1,null,null,1,1,null,1,1,null,1,7]
[9,1,"2022-05-02",44683,null,1,null,1,null,null,1,1,1,1,1,null,null,null,null,7]
[10,1,"2022-05-13",44694,null,1,null,1,null,1,null,1,null,1,1,null,null,1,null,7]
[{"$f":"ROW()-2","v":11},1,"2022-05-20",44701,null,1,null,1,null,1,null,1,null,1,1,null,null,1,null,7]
[12,1,"2022-05-25",44706,null,null,null,null,1,null,null,null,null,null,1,null,null,null,null,2]
[13,1,"2022-05-30",44711,null,1,null,1,null,1,1,null,1,1,1,null,null,null,null,7]
[14,1,"2022-06-10",44722,null,1,null,1,null,1,null,1,null,1,1,null,null,1,null,7]
[15,1,"2022-06-13",44725,null,null,null,1,null,null,1,null,null,1,1,null,null,null,null,4]
[16,1,"2022-06-15",44727,null,null,1,null,1,null,1,1,1,null,1,1,null,null,null,7]
[17,1,"2022-06-16",44728,null,null,1,null,null,1,null,null,1,1,null,1,1,null,1,7]
[18,1,"2022-06-17",44729,null,1,null,1,null,1,null,1,null,1,1,null,null,1,null,7]
[19,1,"2022-06-20",44732,null,1,null,1,null,1,1,null,1,1,1,null,null,null,null,7]
[20,1,"2022-06-21",44733,null,null,null,null,1,null,null,1,1,1,1,1,1,null,null,7]
[21,1,"2022-06-22",44734,null,null,1,null,1,1,1,null,1,null,1,1,null,null,null,7]
[22,1,"2022-06-23",44735,null,null,1,null,null,1,null,null,1,1,null,1,1,null,1,7]
[23,1,"2022-06-24",44736,null,1,null,1,null,1,null,1,null,1,1,null,null,1,null,7]
[24,1,"2022-06-27",44739,null,1,null,1,null,1,1,null,1,1,1,null,null,null,null,7]
[25,1,"2022-06-28",44740,null,null,null,null,1,1,null,null,1,1,1,1,1,null,null,7]
[26,2,"2022-07-06",44748,null,null,1,null,1,null,1,1,1,null,null,1,null,null,null,6]
[27,2,"2022-07-12",44754,null,null,null,null,null,1,null,null,1,1,null,null,1,null,null,4]
[28,2,"2022-09-05",44809,null,1,null,null,null,1,1,null,2,2,null,null,null,null,null,7]
[29,2,"2022-09-06",44810,"遅刻",null,null,null,null,1,null,null,1,null,null,1,1,null,null,4]
[30,2,"2022-09-15",44819,null,null,1,null,null,1,null,null,1,1,null,1,1,null,1,7]
[31,2,"2022-09-16",44820,null,1,null,1,null,1,null,1,null,1,1,null,null,1,null,7]
[32,2,"2022-09-20",44824,"遅刻",null,null,null,null,1,null,null,null,null,null,null,null,null,null,1]
[33,2,"2022-09-28",{"$f":"IF(ISBLANK(C35),\"\",C35)","v":44832},null,null,1,null,1,null,1,1,1,null,1,1,null,null,null,{"$f":"IF(SUM(F35:S35)=0,\"\",SUM(F35:S35))","v":7}]
[34,2,"2022-10-03",44837,null,1,null,1,null,1,1,null,1,1,1,null,null,null,null,7]
[35,2,"2022-10-06",44840,null,null,1,null,null,1,null,null,1,1,null,1,1,null,1,7]
[36,2,"2022-10-11",44845,null,null,null,null,1,1,null,null,1,1,1,1,1,null,null,7]
[37,2,"2022-10-12",44846,null,null,1,null,1,null,1,1,1,null,1,1,null,null,null,7]
[{"$f":"ROW()-2","v":38},2,"2022-10-13",44847,null,null,1,null,null,1,null,null,1,1,null,1,1,null,1,7]
{"$rows_left_out":36}
{"sheet":"3","index":3,"n_rows":45,"n_cols":21,"rows_kept":45,"cut":false,"hidden":false,"merged":[[31,2,31,4],[32,3,32,4],[33,3,33,4],[34,3,34,4],[35,3,35,4],[30,2,30,4],[0,3,0,4],[26,2,26,4],[27,2,27,4],[28,2,28,4],[29,2,29,4]]}
[null,null,3,{"$f":"VLOOKUP(C1,名簿!A:B,2,0)","v":"加藤 康之"},"爲國　紋白","現代文","古典","政治経済","地理B","数学Ⅲ","数学１","数学２","物理","化学","コミュ","表現","体育","総合","HR","合計"]
[null,null,"日","曜日","理由",{"$f":"教科担任に確認!AA3","v":2},{"$f":"教科担任に確認!AA4","v":2},{"$f":"教科担任に確認!AA5","v":2},{"$f":"教科担任に確認!AA6","v":2},{"$f":"教科担任に確認!AA7","v":4},{"$f":"教科担任に確認!AA8","v":2},{"$f":"教科担任に確認!AA9","v":2},{"$f":"教科担任に確認!AA10","v":4},{"$f":"教科担任に確認!AA11","v":4},{"$f":"教科担任に確認!AA12","v":4},{"$f":"教科担任に確認!AA13","v":3},{"$f":"教科担任に確認!AA14","v":2},{"$f":"教科担任に確認!AA15","v":1},{"$f":"教科担任に確認!AA16","v":1},{"$f":"SUM(F2:S2)","v":35},"備考"]
[{"$f":"ROW()-2","v":1},1,"2022-06-08",{"$f":"IF(ISBLANK(C3),\"\",C3)","v":44720},null,null,1,null,1,null,1,1,1,null,1,1,null,null,null,{"$f":"IF(SUM(F3:S3)=0,\"\",SUM(F3:S3))","v":7}]
[2,1,"2022-06-09",{"$f":"IF(ISBLANK(C4),\"\",C4)","v":44721},null,null,1,null,null,1,null,null,1,1,null,1,1,null,1,7]
[3,1,"2022-06-13",{"$f":"IF(ISBLANK(C5),\"\",C5)","v":44725},null,1,null,1,null,1,1,null,1,1,1,null,null,null,null,7]
[4,2,"2022-09-02",44806,null,null,1,1,null,3,null,null,null,1,1,null,null,null,null,7]
[5,2,"2022-10-03",44837,"遅刻",null,null,1,null,null,null,null,null,1,1,null,null,null,null,3]
[6,2,"2022-10-04",44838,null,null,null,null,1,1,null,null,1,1,1,1,1,null,null,7]
[7,2,"2022-10-05",44839,null,null,1,null,1,null,1,1,1,null,1,1,null,null,null,7]
[8,2,"2022-10-28",44862,null,1,null,1,null,1,null,1,1,1,1,null,null,null,null,7]
[9,2,"2022-10-31",44865,null,1,null,1,null,1,1,null,1,1,1,null,null,null,null,7]
[10,2,"2022-11-01",44866,null,null,null,null,null,1,null,null,1,null,null,1,1,null,null,4]
[11,2,"2022-11-02",44867,null,null,1,null,1,null,1,1,1,null,1,1,null,null,null,7]
[12,2,"2022-11-09",{"$f":"IF(ISBLANK(C14),\"\",C14)","v":44874},null,null,1,null,1,1,null,1,1,null,1,1,null,null,null,7]
[13,2,"2022-11-10",44875,null,null,1,null,null,1,null,null,1,1,null,1,1,null,1,7]
[14,2,"2022-11-11",44876,null,null,null,1,null,1,1,1,null,1,1,null,null,1,null,7]
[15,2,"2022-11-15",44880,null,1,null,null,1,1,null,null,1,1,1,null,1,null,null,7]
[16,2,"2022-11-16",44881,null,null,1,null,1,null,1,1,null,1,1,1,null,null,null,7]
[17,2,null,"",null,null,null,null,null,null,null,null,null,null,null,null,null,null,null,""]
[18,2,null,"",null,null,null,null,null,null,null,null,null,null,null,null,null,null,null,""]
[19,2,null,"",null,null,null,null,null,null,null,null,null,null,null,null,null,null,null,""]
[20,2,null,"",null,null,null,null,null,null,null,null,null,null,null,null,null,null,null,""]
[21,2,null,"",null,null,null,null,null,null,null,null,null,null,null,null,null,null,null,""]
[22,2,null,"",null,null,null,null,null,null,null,null,null,null,null,null,null,null,null,""]
[23,3,null,"",null,null,null,null,null,null,null,null,null,null,null,null,null,null,null,""]
[24,3,null,"",null,null,null,null,null,null,null,null,null,null,null,null,null,null,null,""]
[null,4,"１学期合計",null,null,{"$f":"SUM(F$3:F$5)","v":1},2,1,1,2,2,1,3,2,2,2,1,0,1,21]
[null,4,"２学期合計",null,null,{"$f":"SUM(F$6:F$24)","v":3},6,5,6,11,5,6,9,9,11,7,4,1,1,84]
[null,4,"３学期合計",null,null,{"$f":"SUM(F$25:F$26)","v":0},0,0,0,0,0,0,0,0,0,0,0,0,{"$f":"SUM(S$25:S$26)","v":0},""]
[null,4,"合計",null,null,{"$f":"SUM(F27:F29)","v":4},{"$f":"SUM(G27:G29)","v":8},6,{"$f":"SUM(I27:I29)","v":7},13,7,7,{"$f":"SUM(M27:M29)","v":12},{"$f":"SUM(N27:N29)","v":11},13,9,5,1,2,105]
[null,4,"チェック"]
[null,4,"単位数×？",null,null,{"$f":"F30/F2","v":2},4,3,3.5,3.25,3.5,3.5,3,2.75,3.25,3,2.5,1,{"$f":"S30/S2","v":2}]
[null,4,"×４","保護者連絡・改善指導",null,{"$f":"F2*4","v":8},8,8,8,16,8,8,16,16,16,12,8,4,4]
[null,4,"×７","４者面談（保護者・本人・担任・教務）\n補充課題対象",null,{"$f":"F2*7","v":14},14,14,14,28,14,14,28,28,28,21,14,7,7]
[null,4,"×９","５者面談\n（保護者・本人・担任・\n教頭・教務）",null,{"$f":"F2*9","v":18},18,18,18,36,18,18,36,36,36,27,18,9,9]
[null,4,"×１１","DEAD　ZONE",null,{"$f":"F2*11","v":22},22,22,22,44,22,22,44,44,44,33,22,11,11]
[]
[null,null,null,null,null,null,null,null,"遅刻","○"]
[null,null,null,null,null,null,null,null,"早退","△"]
[null,null,null,null,null,null,null,null,"体調不良"]
{"$rows_left_out":6}
{"sheet":"教科担任に確認","index":4,"n_rows":30,"n_cols":28,"rows_kept":30,"cut":false,"hidden":false,"merged":[[28,5,28,14],[2,9,3,12],[2,13,3,14],[21,6,22,8],[21,9,22,12],[21,13,22,14],[8,5,8,14],[9,5,9,14],[27,5,27,14],[0,6,0,9],[2,0,2,1],[19,11,19,14],[5,9,6,10],[0,11,0,14],[3,0,3,1],[2,2,2,4],[3,2,3,4],[24,1,25,4],[2,6,3,8],[24,5,25,8],[24,9,25,10],[19,6,19,9],[21,0,21,1],[22,0,22,1],[5,1,6,4],[5,5,6,8],[21,2,21,4],[22,2,22,4]]}
[{"$f":"名簿!$E$1","v":3},"年",{"$f":"名簿!$E$2","v":1},"組",{"$f":"$Q$2","v":20},"番",{"$f":"VLOOKUP($Q$2,名簿!$A:$B,2,0)","v":"久保 要"},null,null,null,null,"の欠課時数について"]
[null,null,null,null,null,null,null,null,null,null,null,null,null,null,null,null,20,"←","番号",null,null,null,null,null,null,"科目","単位","担当"]
["教科　：",null,{"$f":"VLOOKUP($R$4,$Y$3:$AB$15,2,0)","v":"数学２"},null,null,null,"教科担当：",null,null,{"$f":"VLOOKUP($R$4,$Y$3:$AB$15,4,0)","v":"平田"},null,null,null,"先生",null,null,null,null,null,null,null,null,null,null,1,"現代文",2,"松本"]
["単位数　：",null,{"$f":"VLOOKUP($R$4,$Y$3:$AB$15,3,0)","v":2},null,null,null,null,null,null,null,null,null,null,null,null,null,null,7,"から",13,"まで",null,null,null,2,"古典",2,"田中"]
[null,null,null,null,null,null,null,null,null,null,null,null,null,null,null,null,null,null,null,{"$f":"EVEN(T4)/2","v":7},null,null,null,null,3,"政治経済",2,"加藤"]
[null,"欠課時数",null,null,null,null,null,null,null,"時間",null,null,null,null,null,null,null,null,null,null,null,null,null,null,4,"地理B",2,"山田"]
[null,null,null,null,null,null,null,null,null,null,null,null,null,null,null,null,null,null,null,null,null," ",null,null,5,"数学Ⅲ",4,"土井"]
[null,null,null,null,null,null,null,null,null,null,null,null,null,null,null,null,null,null,null,null,null,null,null,null,6,"数学１",2,"吉村"]
[{"$f":"TEXT($Q$10,\"m\")","v":"2"},"月",{"$f":"TEXT($Q$10,\"d\")","v":"24"},"日",{"$f":"TEXT($Q$10,\"(aaa)\")","v":"(金)"},"現在における欠課時数を、お忙しい所恐縮ですが",null,null,null,null,null,null,null,null,null,null,null,null,null,null,null,null,null,null,7,"数学２",2,"平田"]
[{"$f":"TEXT($Q$12,\"m\")","v":"3"},"月",{"$f":"TEXT($Q$12,\"d\")","v":"3"},"日",{"$f":"TEXT($Q$12,\"(aaa)\")","v":"(金)"},"までに職員室○○のＢＯＸまでにご提出下さい。",null,null,null,null,null,null,null,null,null,null,{"$f":"TODAY()-1","v":"2023-02-24"},"今日から",null,null,null,null,null,null,8,"物理",4,"山内"]
["※差し支えなければ、いつ休んだか、休んだ日を書いてくださると助かります↓",null,null,null,null,null,null,null,null,null,null,null,null,null,null,null,"↓",7,"日後",null,null,null,null,null,9,"化学",4,"斎藤"]
[null,null,null,null,null,null,null,null,null,null,null,null,null,null,null,null,{"$f":"Q10+R11","v":"2023-03-03"},"に提出してもらう",null,null,null,null,null,null,10,"コミュ",4,"川口"]
[null,null,null,null,null,null,null,null,null,null,null,null,null,null,null,null,null,null,null,null,null,null,null,null,11,"表現",3,"石井"]
[null,null,null,null,null,null,null,null,null,null,null,null,null,null,null,null,null,null,null,null,null,null,null,null,12,"体育",2,"吉田"]
[null,null,null,null,null,null,null,null,null,null,null,null,null,null,null,null,null,null,null,null,null,null,null,null,13,"総合",1]
[null,null,null,null,null,null,null,null,null,null,null,null,null,null,null,null,null,null,null,null,null,null,null,null,14,"HR",1]
[]
[]
[]
[{"$f":"名簿!$E$1","v":3},"年",{"$f":"名簿!$E$2","v":1},"組",{"$f":"$Q$2","v":20},"番",{"$f":"VLOOKUP($Q$2,名簿!$A:$B,2,0)","v":"久保 要"},null,null,null,null,"の欠課時数について"]
[]
["教科　：",null,{"$f":"VLOOKUP($R$4+$T$5,$Y$3:$AB$20,2,0)","v":"HR"},null,null,null,"教科担当：",null,null,{"$f":"VLOOKUP($R$4+$T$5,$Y$3:$AB$20,4,0)","v":0},null,null,null,"先生"]
["単位数　：",null,{"$f":"VLOOKUP($R$4+$T$5,$Y$3:$AB$20,3,0)","v":1}]
[]
[null,"欠課時数",null,null,null,null,null,null,null,"時間"]
[]
[]
[{"$f":"TEXT($Q$10,\"m\")","v":"2"},"月",{"$f":"TEXT($Q$10,\"d\")","v":"24"},"日",{"$f":"TEXT($Q$10,\"(aaa)\")","v":"(金)"},"現在における欠課時数を、お忙しい所恐縮ですが"]
[{"$f":"TEXT($Q$12,\"m\")","v":"3"},"月",{"$f":"TEXT($Q$12,\"d\")","v":"3"},"日",{"$f":"TEXT($Q$12,\"(aaa)\")","v":"(金)"},"までに職員室○○のＢＯＸまでにご提出下さい。"]
["※差し支えなければ、いつ休んだか、休んだ日を書いてくださると助かります↓"]

{"sheet":"名簿","index":5,"n_rows":40,"n_cols":5,"rows_kept":40,"cut":false,"hidden":false,"merged":[]}
[1,"松本 太一",null,"学年→",3]
[2,"田中 元",null,"クラス→",1]
[3,"加藤 康之"]
[4,"鈴木 慎司"]
[5,"土井 誠"]
[6,"吉村 潤"]
[7,"平田 裕之"]
[8,"山内 宏"]
[9,"齋藤 正則"]
[10,"川口 隆一"]
[11,"石井 貴也"]
[12,"吉田 正寛"]
[13,"中野 慧"]
[14,"石田 隆二"]
[15,"佐々木 典彦"]
[16,"塚本 明彦"]
[17,"豊田 祐一"]
[18,"青野 和也"]
[19,"比嘉 功"]
[20,"久保 要"]
[21,"清水 愛"]
[22,"田中 早紀"]
[23,"森 由佳"]
[24,"山本 奈央"]
[25,"渡辺 奈津子"]
[26,"高橋 里沙"]
[27,"本田 美香"]
[28,"山田 亜沙美"]
[29,"中村 玲奈"]
[30,"後藤 聡子"]
[31,"佐藤 千佳子"]
[32,"平田 美紀"]
[33,"佐々木 美穂子"]
[34,"中村 菜美"]
[35,"本田 由香"]
[36,"山本 亜季"]
[37,"渡邊 弥生"]
[38,"金子 麻美"]
[39,"山本 みちる"]
[40,"藤本 靖子"]