{"text_format":"1","workbook":"xlsx","n_sheets":8,"sheets":["1確認","2確認","3確認","1学期","2学期","3学期","出席簿に貼る","名簿"],"not_rendered":{"charts":0,"images":0,"macros":1,"external_links":0,"defined_names":4,"comments":0,"pivot_tables":0},"unopened":[],"bounds":{"document_bytes":16777216,"sheet_cells":100000,"rows_first":2000,"rows_last":500,"rows_between":2000,"halvings":0,"cell_chars":16384,"cell_head_chars":4096},"cells_cut":0,"cells_raw":0,"read":"whole","date_system":"1900"}

{"sheet":"1確認","index":0,"n_rows":35,"n_cols":10,"rows_kept":35,"cut":false,"hidden":false,"merged":[[34,0,34,7],[27,0,27,7],[28,0,28,7],[6,0,6,7],[7,0,7,7],[13,0,13,7],[14,0,14,7],[20,0,20,7],[21,0,21,7]]}
[]
[{"$f":"名簿!A1-1+'1確認'!J2","v":1101},{"$f":"VLOOKUP($A2,名簿!$A:$C,3,0)","v":"田中太郎"},null,null,null,null,null,null,null,1]
["1学期の\n授業日数",null,null,null,null,null,"備考"]
[{"$f":"VLOOKUP($A2,テーブル1[],'1学期'!C$1,0)","v":61},null,null,null,null,null,{"$f":"VLOOKUP($A2,テーブル3[],'3学期'!I$1,0)","v":0}]
[null,"4月からの\n出停・忌引","4月からの留学日数","4月からの\n欠席日数","4月からの\n遅刻回数","4月からの\n早退回数","備考","理由"]
[null,{"$f":"SUMIF(テーブル1[番号],'1確認'!$A2,テーブル1[1学期の出停忌引])","v":0},{"$f":"SUMIF(テーブル1[番号],'1確認'!$A2,テーブル1[1学期の留学日数])+SUMIF(テーブル2[番号],'1確認'!$A2,テーブル2[2学期の留学日数])+SUMIF(テーブル3[番号],'1確認'!$A2,テーブル3[3学期の留学日数])","v":0},{"$f":"SUMIF(テーブル1[番号],'1確認'!$A2,テーブル1[1学期の欠席日数])","v":0},{"$f":"SUMIF(テーブル1[番号],'1確認'!$A2,テーブル1[1学期の遅刻回数])","v":0},{"$f":"SUMIF(テーブル1[番号],'1確認'!$A2,テーブル1[1学期の早退回数])","v":0},{"$f":"SUMIF(テーブル1[1学期の出停忌引],'1確認'!$A2,テーブル1[備考])+SUMIF(テーブル2[2学期の出停忌引],'1確認'!$A2,テーブル2[備考])+SUMIF(テーブル3[3学期の出停忌引],'1確認'!$A2,テーブル3[備考])","v":0},{"$f":"VLOOKUP($A2,テーブル1[],'1学期'!J$1,0)","v":"皆勤"}]
{"$rows_left_out":30}
{"sheet":"2確認","index":1,"n_rows":35,"n_cols":10,"rows_kept":35,"cut":false,"hidden":false,"merged":[[34,0,34,7],[27,0,27,7],[28,0,28,7],[7,0,7,7],[13,0,13,7],[14,0,14,7],[20,0,20,7],[21,0,21,7]]}
[]
[{"$f":"3500+J2","v":3508},{"$f":"VLOOKUP($A2,名簿!$A:$C,3,0)","v":{"$error":"#N/A"}},null,null,null,null,null,null,null,8]
["2学期の\n授業日数","2学期の\n出停・忌引","3学期の\n留学日数","2学期の\n欠席日数","2学期の\n遅刻回数","2学期の\n早退回数","備考"]
[{"$f":"VLOOKUP($A2,テーブル2[],'2学期'!C$1,0)","v":{"$error":"#N/A"}},{"$f":"VLOOKUP($A2,テーブル2[],'2学期'!D$1,0)","v":{"$error":"#N/A"}},{"$f":"VLOOKUP($A2,テーブル2[],'2学期'!E$1,0)","v":{"$error":"#N/A"}},{"$f":"VLOOKUP($A2,テーブル2[],'2学期'!F$1,0)","v":{"$error":"#N/A"}},{"$f":"VLOOKUP($A2,テーブル2[],'2学期'!G$1,0)","v":{"$error":"#N/A"}},{"$f":"VLOOKUP($A2,テーブル2[],'2学期'!H$1,0)","v":{"$error":"#N/A"}},{"$f":"VLOOKUP($A2,テーブル3[],'3学期'!I$1,0)","v":{"$error":"#N/A"}}]
[null,"4月からの\n出停・忌引","4月からの留学日数","4月からの\n欠席日数","4月からの\n遅刻回数","4月からの\n早退回数","備考","理由"]
[null,{"$f":"SUMIF(テーブル1[番号],'2確認'!$A2,テーブル1[1学期の出停忌引])+SUMIF(テーブル2[番号],'2確認'!$A2,テーブル2[2学期の出停忌引])","v":0},{"$f":"SUMIF(テーブル1[番号],'2確認'!$A2,テーブル1[1学期の留学日数])+SUMIF(テーブル2[番号],'2確認'!$A2,テーブル2[2学期の留学日数])+SUMIF(テーブル3[番号],'2確認'!$A2,テーブル3[3学期の留学日数])","v":0},{"$f":"SUMIF(テーブル1[番号],'2確認'!$A2,テーブル1[1学期の欠席日数])+SUMIF(テーブル2[番号],'2確認'!$A2,テーブル2[2学期の欠席日数])","v":0},{"$f":"SUMIF(テーブル1[番号],'2確認'!$A2,テーブル1[1学期の遅刻回数])+SUMIF(テーブル2[番号],'2確認'!$A2,テーブル2[2学期の遅刻回数])","v":0},{"$f":"SUMIF(テーブル1[番号],'2確認'!$A2,テーブル1[1学期の早退回数])+SUMIF(テーブル2[番号],'2確認'!$A2,テーブル2[2学期の早退回数])","v":0},{"$f":"SUMIF(テーブル1[1学期の出停忌引],'2確認'!$A2,テーブル1[備考])+SUMIF(テーブル2[2学期の出停忌引],'2確認'!$A2,テーブル2[備考])+SUMIF(テーブル3[3学期の出停忌引],'2確認'!$A2,テーブル3[備考])","v":0},{"$f":"VLOOKUP($A2,テーブル2[],'2学期'!J$1,0)","v":{"$error":"#N/A"}}]
{"$rows_left_out":30}
{"sheet":"3確認","index":2,"n_rows":35,"n_cols":10,"rows_kept":35,"cut":false,"hidden":false,"merged":[[27,0,27,7],[28,0,28,7],[34,0,34,7],[7,0,7,7],[13,0,13,7],[14,0,14,7],[20,0,20,7],[21,0,21,7]]}
[]
[{"$f":"'1確認'!A2","v":1101},{"$f":"VLOOKUP($A2,名簿!$A:$C,3,0)","v":"田中太郎"},null,null,null,null,null,null,null,5]
["3学期の\n授業日数","3学期の\n出停・忌引","3学期の\n留学日数","3学期の\n欠席日数","3学期の\n遅刻回数","3学期の\n早退回数","備考"]
[{"$f":"VLOOKUP($A2,テーブル3[],'3学期'!C$1,0)","v":56},{"$f":"VLOOKUP($A2,テーブル3[],'3学期'!D$1,0)","v":0},{"$f":"VLOOKUP($A2,テーブル3[],'3学期'!E$1,0)","v":0},{"$f":"VLOOKUP($A2,テーブル3[],'3学期'!F$1,0)","v":0},{"$f":"VLOOKUP($A2,テーブル3[],'3学期'!G$1,0)","v":0},{"$f":"VLOOKUP($A2,テーブル3[],'3学期'!H$1,0)","v":0},{"$f":"VLOOKUP($A2,テーブル3[],'3学期'!I$1,0)","v":0}]
[null,"4月からの\n出停・忌引","4月からの留学日数","4月からの\n欠席日数","4月からの\n遅刻回数","4月からの\n早退回数","備考","理由"]
[null,{"$f":"SUMIF(テーブル1[番号],'3確認'!$A2,テーブル1[1学期の出停忌引])+SUMIF(テーブル2[番号],'3確認'!$A2,テーブル2[2学期の出停忌引])+SUMIF(テーブル3[番号],'3確認'!$A2,テーブル3[3学期の出停忌引])","v":0},{"$f":"SUMIF(テーブル1[番号],'3確認'!$A2,テーブル1[1学期の留学日数])+SUMIF(テーブル2[番号],'3確認'!$A2,テーブル2[2学期の留学日数])+SUMIF(テーブル3[番号],'3確認'!$A2,テーブル3[3学期の留学日数])","v":0},{"$f":"SUMIF(テーブル1[番号],'3確認'!$A2,テーブル1[1学期の欠席日数])+SUMIF(テーブル2[番号],'3確認'!$A2,テーブル2[2学期の欠席日数])+SUMIF(テーブル3[番号],'3確認'!$A2,テーブル3[3学期の欠席日数])","v":0},{"$f":"SUMIF(テーブル1[番号],'3確認'!$A2,テーブル1[1学期の遅刻回数])+SUMIF(テーブル2[番号],'3確認'!$A2,テーブル2[2学期の遅刻回数])+SUMIF(テーブル3[番号],'3確認'!$A2,テーブル3[3学期の遅刻回数])","v":0},{"$f":"SUMIF(テーブル1[番号],'3確認'!$A2,テーブル1[1学期の早退回数])+SUMIF(テーブル2[番号],'3確認'!$A2,テーブル2[2学期の早退回数])+SUMIF(テーブル3[番号],'3確認'!$A2,テーブル3[3学期の早退回数])","v":0},{"$f":"SUMIF(テーブル1[1学期の出停忌引],'3確認'!$A2,テーブル1[備考])+SUMIF(テーブル2[2学期の出停忌引],'3確認'!$A2,テーブル2[備考])+SUMIF(テーブル3[3学期の出停忌引],'3確認'!$A2,テーブル3[備考])","v":0},{"$f":"VLOOKUP($A2,テーブル3[],'3学期'!J$1,0)","v":"皆勤"}]
{"$rows_left_out":30}
{"sheet":"1学期","index":3,"n_rows":45,"n_cols":46,"rows_kept":45,"cut":false,"hidden":false,"merged":[]}
[1,2,3,4,5,6,7,8,9,10]
["番号","名前","1学期の授業日数","1学期の出停忌引","1学期の留学日数","1学期の欠席日数","1学期の遅刻回数","1学期の早退回数","備考","連絡",null,"感染症予防のため","感染症のため","祖母葬儀","祖父葬儀","入試","体調不良","発熱","風邪","頭痛","腹痛","腰痛","通院","怪我","家事都合","自己都合","遅刻\n早退","欠席合計",null,"感染症予防のため","感染症のため","祖母葬儀","祖父葬儀","入試","体調不良","発熱","風邪","頭痛","腹痛","腰痛","通院","怪我","家事都合","自己都合",null,"、あり"]
[{"$f":"IF(名簿!$A1=\"\",\"\",名簿!$A1)","v":1101},{"$f":"IFERROR(VLOOKUP($A3,名簿!$A:$C,3,0),\"\")","v":"田中太郎"},61,0,0,0,0,0,null,{"$f":"IF(AT3=\"\",IF('1学期'!AA3=\"あり\",\"特記事項なし\",\"皆勤\"),IF(AND('1学期'!AA3=\"\",COUNTBLANK(AI3:AQ3)=COUNTA($AI$2:$AQ$2)),\"皆勤、\"&LEFT(AT3,LEN(AT3)-1),LEFT(AT3,LEN(AT3)-1)))","v":"皆勤"},null,null,null,null,null,null,null,null,null,null,null,null,null,null,null,null,null,null,null,{"$f":"IF(L3=\"\",\"\",L$2&L3&\"、\")","v":""},{"$f":"IF(M3=\"\",\"\",M$2&M3&\"、\")","v":""},"","","","","","","","","","","","","",null,{"$f":"CONCATENATE(AI3,AJ3,AK3,AL3,AM3,AN3,AO3,AP3,AQ3,AR3,AD3,AE3,AF3,AG3,AH3)","v":""}]
[{"$f":"IF(名簿!$A2=\"\",\"\",名簿!$A2)","v":1102},{"$f":"IFERROR(VLOOKUP($A4,名簿!$A:$C,3,0),\"\")","v":"小林治郎"},61,0,0,0,0,0,null,{"$f":"IF(AT4=\"\",IF('1学期'!AA4=\"あり\",\"特記事項なし\",\"皆勤\"),IF(AND('1学期'!AA4=\"\",COUNTBLANK(AI4:AQ4)=COUNTA($AI$2:$AQ$2)),\"皆勤、\"&LEFT(AT4,LEN(AT4)-1),LEFT(AT4,LEN(AT4)-1)))","v":"皆勤"},null,null,null,null,null,null,null,null,null,null,null,null,null,null,null,null,null,null,null,{"$f":"IF(L4=\"\",\"\",L$2&L4&\"、\")","v":""},{"$f":"IF(M4=\"\",\"\",M$2&M4&\"、\")","v":""},{"$f":"IF(N4=\"\",\"\",N$2&N4&\"、\")","v":""},{"$f":"IF(O4=\"\",\"\",O$2&O4&\"、\")","v":""},{"$f":"IF(P4=\"\",\"\",P$2&P4&\"、\")","v":""},{"$f":"IF(Q4=\"\",\"\",Q$2&Q4&\"、\")","v":""},{"$f":"IF(R4=\"\",\"\",R$2&R4&\"、\")","v":""},{"$f":"IF(S4=\"\",\"\",S$2&S4&\"、\")","v":""},{"$f":"IF(T4=\"\",\"\",T$2&T4&\"、\")","v":""},{"$f":"IF(U4=\"\",\"\",U$2&U4&\"、\")","v":""},{"$f":"IF(V4=\"\",\"\",V$2&V4&\"、\")","v":""},{"$f":"IF(W4=\"\",\"\",W$2&W4&\"、\")","v":""},{"$f":"IF(X4=\"\",\"\",X$2&X4&\"、\")","v":""},{"$f":"IF(Y4=\"\",\"\",Y$2&Y4&\"、\")","v":""},{"$f":"IF(Z4=\"\",\"\",Z$2&Z4&\"、\")","v":""},null,{"$f":"CONCATENATE(AI4,AJ4,AK4,AL4,AM4,AN4,AO4,AP4,AQ4,AR4,AD4,AE4,AF4,AG4,AH4)","v":""}]
[{"$f":"IF(名簿!$A3=\"\",\"\",名簿!$A3)","v":1103},{"$f":"IFERROR(VLOOKUP($A5,名簿!$A:$C,3,0),\"\")","v":"佐藤三郎"},61,0,0,0,0,0,null,{"$f":"IF(AT5=\"\",IF('1学期'!AA5=\"あり\",\"特記事項なし\",\"皆勤\"),IF(AND('1学期'!AA5=\"\",COUNTBLANK(AI5:AQ5)=COUNTA($AI$2:$AQ$2)),\"皆勤、\"&LEFT(AT5,LEN(AT5)-1),LEFT(AT5,LEN(AT5)-1)))","v":"皆勤"},null,null,null,null,null,null,null,null,null,null,null,null,null,null,null,null,null,null,null,"","","","","","","","","","","","","","","",null,""]
[{"$f":"IF(名簿!$A4=\"\",\"\",名簿!$A4)","v":1104},{"$f":"IFERROR(VLOOKUP($A6,名簿!$A:$C,3,0),\"\")","v":"山田花子"},61,0,0,11,0,0,null,{"$f":"IF(AT6=\"\",IF('1学期'!AA6=\"あり\",\"特記事項なし\",\"皆勤\"),IF(AND('1学期'!AA6=\"\",COUNTBLANK(AI6:AQ6)=COUNTA($AI$2:$AQ$2)),\"皆勤、\"&LEFT(AT6,LEN(AT6)-1),LEFT(AT6,LEN(AT6)-1)))","v":"体調不良8、頭痛3"},null,null,null,null,null,null,8,null,null,3,null,null,null,null,null,null,null,null,null,"","","","","","体調不良8、","","","頭痛3、","","","","","","",null,"体調不良8、頭痛3、"]
{"$rows_left_out":40}
{"sheet":"2学期","index":4,"n_rows":45,"n_cols":46,"rows_kept":45,"cut":false,"hidden":false,"merged":[]}
[null,2,3,4,5,6,7,8,9,10]
["番号","名前","2学期の授業日数","2学期の出停忌引","2学期の留学日数","2学期の欠席日数","2学期の遅刻回数","2学期の早退回数","備考","連絡",null,"感染症予防のため","感染症のため","祖母葬儀","祖父葬儀","入試","体調不良","発熱","風邪","頭痛","腹痛","腰痛","通院","怪我","家事都合","自己都合","遅刻\n早退","欠席合計",null,"感染症予防のため","感染症のため","祖母葬儀","祖父葬儀","入試","体調不良","発熱","風邪","頭痛","腹痛","腰痛","通院","怪我","家事都合","自己都合",null,"、あり"]
[{"$f":"IF(名簿!$A1=\"\",\"\",名簿!$A1)","v":1101},{"$f":"IFERROR(VLOOKUP($A3,名簿!$A:$C,3,0),\"\")","v":"田中太郎"},72,0,0,0,0,0,null,{"$f":"IF(AT3=\"\",IF(OR('1学期'!AA3=\"あり\",'2学期'!AA3=\"あり\"),\"特記事項なし\",\"皆勤\"),IF(AND('1学期'!AA3=\"\",'2学期'!AA3=\"\",COUNTBLANK(AI3:AQ3)=COUNTA($AI$2:$AQ$2)),\"皆勤、\"&LEFT(AT3,LEN(AT3)-1),LEFT(AT3,LEN(AT3)-1)))","v":"皆勤"},null,null,null,null,null,null,null,null,null,null,null,null,null,null,null,null,null,null,null,{"$f":"IF(AND(L3=\"\",'1学期'!L3=\"\"),\"\",L$2&L3+'1学期'!L3&\"、\")","v":""},{"$f":"IF(AND(M3=\"\",'1学期'!M3=\"\"),\"\",M$2&M3+'1学期'!M3&\"、\")","v":""},{"$f":"IF(AND(N3=\"\",'1学期'!N3=\"\"),\"\",N$2&N3+'1学期'!N3&\"、\")","v":""},{"$f":"IF(AND(O3=\"\",'1学期'!O3=\"\"),\"\",O$2&O3+'1学期'!O3&\"、\")","v":""},{"$f":"IF(AND(P3=\"\",'1学期'!P3=\"\"),\"\",P$2&P3+'1学期'!P3&\"、\")","v":""},{"$f":"IF(AND(Q3=\"\",'1学期'!Q3=\"\"),\"\",Q$2&Q3+'1学期'!Q3&\"、\")","v":""},{"$f":"IF(AND(R3=\"\",'1学期'!R3=\"\"),\"\",R$2&R3+'1学期'!R3&\"、\")","v":""},{"$f":"IF(AND(S3=\"\",'1学期'!S3=\"\"),\"\",S$2&S3+'1学期'!S3&\"、\")","v":""},{"$f":"IF(AND(T3=\"\",'1学期'!T3=\"\"),\"\",T$2&T3+'1学期'!T3&\"、\")","v":""},{"$f":"IF(AND(U3=\"\",'1学期'!U3=\"\"),\"\",U$2&U3+'1学期'!U3&\"、\")","v":""},{"$f":"IF(AND(V3=\"\",'1学期'!V3=\"\"),\"\",V$2&V3+'1学期'!V3&\"、\")","v":""},{"$f":"IF(AND(W3=\"\",'1学期'!W3=\"\"),\"\",W$2&W3+'1学期'!W3&\"、\")","v":""},{"$f":"IF(AND(X3=\"\",'1学期'!X3=\"\"),\"\",X$2&X3+'1学期'!X3&\"、\")","v":""},{"$f":"IF(AND(Y3=\"\",'1学期'!Y3=\"\"),\"\",Y$2&Y3+'1学期'!Y3&\"、\")","v":""},{"$f":"IF(AND(Z3=\"\",'1学期'!Z3=\"\"),\"\",Z$2&Z3+'1学期'!Z3&\"、\")","v":""},null,{"$f":"CONCATENATE(AI3,AJ3,AK3,AL3,AM3,AN3,AO3,AP3,AQ3,AR3,AD3,AE3,AF3,AG3,AH3)","v":""}]
[{"$f":"IF(名簿!$A2=\"\",\"\",名簿!$A2)","v":1102},{"$f":"IFERROR(VLOOKUP($A4,名簿!$A:$C,3,0),\"\")","v":"小林治郎"},72,0,0,0,0,0,null,{"$f":"IF(AT4=\"\",IF(OR('1学期'!AA4=\"あり\",'2学期'!AA4=\"あり\"),\"特記事項なし\",\"皆勤\"),IF(AND('1学期'!AA4=\"\",'2学期'!AA4=\"\",COUNTBLANK(AI4:AQ4)=COUNTA($AI$2:$AQ$2)),\"皆勤、\"&LEFT(AT4,LEN(AT4)-1),LEFT(AT4,LEN(AT4)-1)))","v":"皆勤"},null,null,null,null,null,null,null,null,null,null,null,null,null,null,null,null,null,null,null,{"$f":"IF(AND(L4=\"\",'1学期'!L4=\"\"),\"\",L$2&L4+'1学期'!L4&\"、\")","v":""},{"$f":"IF(AND(M4=\"\",'1学期'!M4=\"\"),\"\",M$2&M4+'1学期'!M4&\"、\")","v":""},{"$f":"IF(AND(N4=\"\",'1学期'!N4=\"\"),\"\",N$2&N4+'1学期'!N4&\"、\")","v":""},{"$f":"IF(AND(O4=\"\",'1学期'!O4=\"\"),\"\",O$2&O4+'1学期'!O4&\"、\")","v":""},{"$f":"IF(AND(P4=\"\",'1学期'!P4=\"\"),\"\",P$2&P4+'1学期'!P4&\"、\")","v":""},{"$f":"IF(AND(Q4=\"\",'1学期'!Q4=\"\"),\"\",Q$2&Q4+'1学期'!Q4&\"、\")","v":""},{"$f":"IF(AND(R4=\"\",'1学期'!R4=\"\"),\"\",R$2&R4+'1学期'!R4&\"、\")","v":""},{"$f":"IF(AND(S4=\"\",'1学期'!S4=\"\"),\"\",S$2&S4+'1学期'!S4&\"、\")","v":""},{"$f":"IF(AND(T4=\"\",'1学期'!T4=\"\"),\"\",T$2&T4+'1学期'!T4&\"、\")","v":""},{"$f":"IF(AND(U4=\"\",'1学期'!U4=\"\"),\"\",U$2&U4+'1学期'!U4&\"、\")","v":""},{"$f":"IF(AND(V4=\"\",'1学期'!V4=\"\"),\"\",V$2&V4+'1学期'!V4&\"、\")","v":""},{"$f":"IF(AND(W4=\"\",'1学期'!W4=\"\"),\"\",W$2&W4+'1学期'!W4&\"、\")","v":""},{"$f":"IF(AND(X4=\"\",'1学期'!X4=\"\"),\"\",X$2&X4+'1学期'!X4&\"、\")","v":""},{"$f":"IF(AND(Y4=\"\",'1学期'!Y4=\"\"),\"\",Y$2&Y4+'1学期'!Y4&\"、\")","v":""},{"$f":"IF(AND(Z4=\"\",'1学期'!Z4=\"\"),\"\",Z$2&Z4+'1学期'!Z4&\"、\")","v":""},null,{"$f":"CONCATENATE(AI4,AJ4,AK4,AL4,AM4,AN4,AO4,AP4,AQ4,AR4,AD4,AE4,AF4,AG4,AH4)","v":""}]
[{"$f":"IF(名簿!$A3=\"\",\"\",名簿!$A3)","v":1103},{"$f":"IFERROR(VLOOKUP($A5,名簿!$A:$C,3,0),\"\")","v":"佐藤三郎"},72,1,0,0,0,0,null,{"$f":"IF(AT5=\"\",IF(OR('1学期'!AA5=\"あり\",'2学期'!AA5=\"あり\"),\"特記事項なし\",\"皆勤\"),IF(AND('1学期'!AA5=\"\",'2学期'!AA5=\"\",COUNTBLANK(AI5:AQ5)=COUNTA($AI$2:$AQ$2)),\"皆勤、\"&LEFT(AT5,LEN(AT5)-1),LEFT(AT5,LEN(AT5)-1)))","v":"皆勤"},null,null,null,null,null,null,null,null,null,null,null,null,null,null,null,null,null,null,null,{"$f":"IF(AND(L5=\"\",'1学期'!L5=\"\"),\"\",L$2&L5+'1学期'!L5&\"、\")","v":""},{"$f":"IF(AND(M5=\"\",'1学期'!M5=\"\"),\"\",M$2&M5+'1学期'!M5&\"、\")","v":""},{"$f":"IF(AND(N5=\"\",'1学期'!N5=\"\"),\"\",N$2&N5+'1学期'!N5&\"、\")","v":""},{"$f":"IF(AND(O5=\"\",'1学期'!O5=\"\"),\"\",O$2&O5+'1学期'!O5&\"、\")","v":""},{"$f":"IF(AND(P5=\"\",'1学期'!P5=\"\"),\"\",P$2&P5+'1学期'!P5&\"、\")","v":""},{"$f":"IF(AND(Q5=\"\",'1学期'!Q5=\"\"),\"\",Q$2&Q5+'1学期'!Q5&\"、\")","v":""},{"$f":"IF(AND(R5=\"\",'1学期'!R5=\"\"),\"\",R$2&R5+'1学期'!R5&\"、\")","v":""},{"$f":"IF(AND(S5=\"\",'1学期'!S5=\"\"),\"\",S$2&S5+'1学期'!S5&\"、\")","v":""},{"$f":"IF(AND(T5=\"\",'1学期'!T5=\"\"),\"\",T$2&T5+'1学期'!T5&\"、\")","v":""},{"$f":"IF(AND(U5=\"\",'1学期'!U5=\"\"),\"\",U$2&U5+'1学期'!U5&\"、\")","v":""},{"$f":"IF(AND(V5=\"\",'1学期'!V5=\"\"),\"\",V$2&V5+'1学期'!V5&\"、\")","v":""},{"$f":"IF(AND(W5=\"\",'1学期'!W5=\"\"),\"\",W$2&W5+'1学期'!W5&\"、\")","v":""},{"$f":"IF(AND(X5=\"\",'1学期'!X5=\"\"),\"\",X$2&X5+'1学期'!X5&\"、\")","v":""},{"$f":"IF(AND(Y5=\"\",'1学期'!Y5=\"\"),\"\",Y$2&Y5+'1学期'!Y5&\"、\")","v":""},{"$f":"IF(AND(Z5=\"\",'1学期'!Z5=\"\"),\"\",Z$2&Z5+'1学期'!Z5&\"、\")","v":""},null,""]
[{"$f":"IF(名簿!$A4=\"\",\"\",名簿!$A4)","v":1104},{"$f":"IFERROR(VLOOKUP($A6,名簿!$A:$C,3,0),\"\")","v":"山田花子"},72,3,0,1,0,0,null,{"$f":"IF(AT6=\"\",IF(OR('1学期'!AA6=\"あり\",'2学期'!AA6=\"あり\"),\"特記事項なし\",\"皆勤\"),IF(AND('1学期'!AA6=\"\",'2学期'!AA6=\"\",COUNTBLANK(AI6:AQ6)=COUNTA($AI$2:$AQ$2)),\"皆勤、\"&LEFT(AT6,LEN(AT6)-1),LEFT(AT6,LEN(AT6)-1)))","v":"体調不良9、頭痛3、感染症のため3"},null,null,3,null,null,null,1,null,null,null,null,null,null,null,null,null,null,null,null,{"$f":"IF(AND(L6=\"\",'1学期'!L6=\"\"),\"\",L$2&L6+'1学期'!L6&\"、\")","v":""},{"$f":"IF(AND(M6=\"\",'1学期'!M6=\"\"),\"\",M$2&M6+'1学期'!M6&\"、\")","v":"感染症のため3、"},{"$f":"IF(AND(N6=\"\",'1学期'!N6=\"\"),\"\",N$2&N6+'1学期'!N6&\"、\")","v":""},{"$f":"IF(AND(O6=\"\",'1学期'!O6=\"\"),\"\",O$2&O6+'1学期'!O6&\"、\")","v":""},{"$f":"IF(AND(P6=\"\",'1学期'!P6=\"\"),\"\",P$2&P6+'1学期'!P6&\"、\")","v":""},{"$f":"IF(AND(Q6=\"\",'1学期'!Q6=\"\"),\"\",Q$2&Q6+'1学期'!Q6&\"、\")","v":"体調不良9、"},{"$f":"IF(AND(R6=\"\",'1学期'!R6=\"\"),\"\",R$2&R6+'1学期'!R6&\"、\")","v":""},{"$f":"IF(AND(S6=\"\",'1学期'!S6=\"\"),\"\",S$2&S6+'1学期'!S6&\"、\")","v":""},{"$f":"IF(AND(T6=\"\",'1学期'!T6=\"\"),\"\",T$2&T6+'1学期'!T6&\"、\")","v":"頭痛3、"},{"$f":"IF(AND(U6=\"\",'1学期'!U6=\"\"),\"\",U$2&U6+'1学期'!U6&\"、\")","v":""},{"$f":"IF(AND(V6=\"\",'1学期'!V6=\"\"),\"\",V$2&V6+'1学期'!V6&\"、\")","v":""},{"$f":"IF(AND(W6=\"\",'1学期'!W6=\"\"),\"\",W$2&W6+'1学期'!W6&\"、\")","v":""},{"$f":"IF(AND(X6=\"\",'1学期'!X6=\"\"),\"\",X$2&X6+'1学期'!X6&\"、\")","v":""},{"$f":"IF(AND(Y6=\"\",'1学期'!Y6=\"\"),\"\",Y$2&Y6+'1学期'!Y6&\"、\")","v":""},{"$f":"IF(AND(Z6=\"\",'1学期'!Z6=\"\"),\"\",Z$2&Z6+'1学期'!Z6&\"、\")","v":""},null,"体調不良9、頭痛3、感染症のため3、"]
{"$rows_left_out":40}
{"sheet":"3学期","index":5,"n_rows":45,"n_cols":48,"rows_kept":45,"cut":false,"hidden":false,"merged":[]}
[1,2,3,4,5,6,7,8,9,10]
["番号","名前","3学期の授業日数","3学期の出停忌引","3学期の留学日数","3学期の欠席日数","3学期の遅刻回数","3学期の早退回数","備考","連絡",null,"感染症予防のため","感染症のため","祖母葬儀","祖父葬儀","入試","体調不良","発熱","風邪","頭痛","腹痛","腰痛","通院","怪我","家事都合","自己都合","遅刻\n早退","欠席合計",null,"感染症予防のため","感染症のため","祖母葬儀","祖父葬儀","入試","体調不良","発熱","風邪","頭痛","腹痛","腰痛","通院","怪我","家事都合","自己都合",null,"、あり"]
[{"$f":"IF(名簿!$A1=\"\",\"\",名簿!$A1)","v":1101},{"$f":"IFERROR(VLOOKUP($A3,名簿!$A:$C,3,0),\"\")","v":"田中太郎"},56,0,0,0,0,0,null,{"$f":"IF(AT3=\"\",IF(OR('1学期'!AA3=\"あり\",'2学期'!AA3=\"あり\",AA3=\"あり\"),\"特記事項なし\",\"皆勤\"),IF(AND('1学期'!AA3=\"\",'2学期'!AA3=\"\",AA3=\"\",COUNTBLANK(AI3:AQ3)=COUNTA($AI$2:$AQ$2)),\"皆勤、\"&LEFT(AT3,LEN(AT3)-1),LEFT(AT3,LEN(AT3)-1)))","v":"皆勤"},null,null,null,null,null,null,null,null,null,null,null,null,null,null,null,null,null,null,null,{"$f":"IF(AND(L3=\"\",'1学期'!L3=\"\",'2学期'!L3=\"\"),\"\",L$2&L3+'1学期'!L3+'2学期'!L3&\"、\")","v":""},{"$f":"IF(AND(M3=\"\",'1学期'!M3=\"\",'2学期'!M3=\"\"),\"\",M$2&M3+'1学期'!M3+'2学期'!M3&\"、\")","v":""},{"$f":"IF(AND(N3=\"\",'1学期'!N3=\"\",'2学期'!N3=\"\"),\"\",N$2&N3+'1学期'!N3+'2学期'!N3&\"、\")","v":""},{"$f":"IF(AND(O3=\"\",'1学期'!O3=\"\",'2学期'!O3=\"\"),\"\",O$2&O3+'1学期'!O3+'2学期'!O3&\"、\")","v":""},{"$f":"IF(AND(P3=\"\",'1学期'!P3=\"\",'2学期'!P3=\"\"),\"\",P$2&P3+'1学期'!P3+'2学期'!P3&\"、\")","v":""},{"$f":"IF(AND(Q3=\"\",'1学期'!Q3=\"\",'2学期'!Q3=\"\"),\"\",Q$2&Q3+'1学期'!Q3+'2学期'!Q3&\"、\")","v":""},{"$f":"IF(AND(R3=\"\",'1学期'!R3=\"\",'2学期'!R3=\"\"),\"\",R$2&R3+'1学期'!R3+'2学期'!R3&\"、\")","v":""},{"$f":"IF(AND(S3=\"\",'1学期'!S3=\"\",'2学期'!S3=\"\"),\"\",S$2&S3+'1学期'!S3+'2学期'!S3&\"、\")","v":""},{"$f":"IF(AND(T3=\"\",'1学期'!T3=\"\",'2学期'!T3=\"\"),\"\",T$2&T3+'1学期'!T3+'2学期'!T3&\"、\")","v":""},{"$f":"IF(AND(U3=\"\",'1学期'!U3=\"\",'2学期'!U3=\"\"),\"\",U$2&U3+'1学期'!U3+'2学期'!U3&\"、\")","v":""},{"$f":"IF(AND(V3=\"\",'1学期'!V3=\"\",'2学期'!V3=\"\"),\"\",V$2&V3+'1学期'!V3+'2学期'!V3&\"、\")","v":""},{"$f":"IF(AND(W3=\"\",'1学期'!W3=\"\",'2学期'!W3=\"\"),\"\",W$2&W3+'1学期'!W3+'2学期'!W3&\"、\")","v":""},{"$f":"IF(AND(X3=\"\",'1学期'!X3=\"\",'2学期'!X3=\"\"),\"\",X$2&X3+'1学期'!X3+'2学期'!X3&\"、\")","v":""},{"$f":"IF(AND(Y3=\"\",'1学期'!Y3=\"\",'2学期'!Y3=\"\"),\"\",Y$2&Y3+'1学期'!Y3+'2学期'!Y3&\"、\")","v":""},{"$f":"IF(AND(Z3=\"\",'1学期'!Z3=\"\",'2学期'!Z3=\"\"),\"\",Z$2&Z3+'1学期'!Z3+'2学期'!Z3&\"、\")","v":""},null,{"$f":"CONCATENATE(AI3,AJ3,AK3,AL3,AM3,AN3,AO3,AP3,AQ3,AR3,AD3,AE3,AF3,AG3,AH3)","v":""},null,"\"=IF(AI3=\"\",IF(OR('1学期'!V3=\"あり\",'2学期'!V3=\"あり\",V3=\"あり\"),\"特記事項なし\",\"皆勤\"),IF(AND('1学期'!V3=\"\",'2学期'!V3=\"\",V3=\"\",COUNTBLANK(AA3:AG3)=COUNTA($AA$2:$AG$2)),\"皆勤、\"&LEFT(AI3,LEN(AI3)-1),LEFT(AI3,LEN(AI3)-1)))"]
[{"$f":"IF(名簿!$A2=\"\",\"\",名簿!$A2)","v":1102},{"$f":"IFERROR(VLOOKUP($A4,名簿!$A:$C,3,0),\"\")","v":"小林治郎"},56,0,0,0,0,0,null,{"$f":"IF(AT4=\"\",IF(OR('1学期'!AA4=\"あり\",'2学期'!AA4=\"あり\",AA4=\"あり\"),\"特記事項なし\",\"皆勤\"),IF(AND('1学期'!AA4=\"\",'2学期'!AA4=\"\",AA4=\"\",COUNTBLANK(AI4:AQ4)=COUNTA($AI$2:$AQ$2)),\"皆勤、\"&LEFT(AT4,LEN(AT4)-1),LEFT(AT4,LEN(AT4)-1)))","v":"皆勤、感染症予防のため7"},null,7,null,null,null,null,null,null,null,null,null,null,null,null,null,null,null,null,null,{"$f":"IF(AND(L4=\"\",'1学期'!L4=\"\",'2学期'!L4=\"\"),\"\",L$2&L4+'1学期'!L4+'2学期'!L4&\"、\")","v":"感染症予防のため7、"},{"$f":"IF(AND(M4=\"\",'1学期'!M4=\"\",'2学期'!M4=\"\"),\"\",M$2&M4+'1学期'!M4+'2学期'!M4&\"、\")","v":""},{"$f":"IF(AND(N4=\"\",'1学期'!N4=\"\",'2学期'!N4=\"\"),\"\",N$2&N4+'1学期'!N4+'2学期'!N4&\"、\")","v":""},{"$f":"IF(AND(O4=\"\",'1学期'!O4=\"\",'2学期'!O4=\"\"),\"\",O$2&O4+'1学期'!O4+'2学期'!O4&\"、\")","v":""},{"$f":"IF(AND(P4=\"\",'1学期'!P4=\"\",'2学期'!P4=\"\"),\"\",P$2&P4+'1学期'!P4+'2学期'!P4&\"、\")","v":""},{"$f":"IF(AND(Q4=\"\",'1学期'!Q4=\"\",'2学期'!Q4=\"\"),\"\",Q$2&Q4+'1学期'!Q4+'2学期'!Q4&\"、\")","v":""},{"$f":"IF(AND(R4=\"\",'1学期'!R4=\"\",'2学期'!R4=\"\"),\"\",R$2&R4+'1学期'!R4+'2学期'!R4&\"、\")","v":""},{"$f":"IF(AND(S4=\"\",'1学期'!S4=\"\",'2学期'!S4=\"\"),\"\",S$2&S4+'1学期'!S4+'2学期'!S4&\"、\")","v":""},{"$f":"IF(AND(T4=\"\",'1学期'!T4=\"\",'2学期'!T4=\"\"),\"\",T$2&T4+'1学期'!T4+'2学期'!T4&\"、\")","v":""},{"$f":"IF(AND(U4=\"\",'1学期'!U4=\"\",'2学期'!U4=\"\"),\"\",U$2&U4+'1学期'!U4+'2学期'!U4&\"、\")","v":""},{"$f":"IF(AND(V4=\"\",'1学期'!V4=\"\",'2学期'!V4=\"\"),\"\",V$2&V4+'1学期'!V4+'2学期'!V4&\"、\")","v":""},{"$f":"IF(AND(W4=\"\",'1学期'!W4=\"\",'2学期'!W4=\"\"),\"\",W$2&W4+'1学期'!W4+'2学期'!W4&\"、\")","v":""},{"$f":"IF(AND(X4=\"\",'1学期'!X4=\"\",'2学期'!X4=\"\"),\"\",X$2&X4+'1学期'!X4+'2学期'!X4&\"、\")","v":""},{"$f":"IF(AND(Y4=\"\",'1学期'!Y4=\"\",'2学期'!Y4=\"\"),\"\",Y$2&Y4+'1学期'!Y4+'2学期'!Y4&\"、\")","v":""},{"$f":"IF(AND(Z4=\"\",'1学期'!Z4=\"\",'2学期'!Z4=\"\"),\"\",Z$2&Z4+'1学期'!Z4+'2学期'!Z4&\"、\")","v":""},null,{"$f":"CONCATENATE(AI4,AJ4,AK4,AL4,AM4,AN4,AO4,AP4,AQ4,AR4,AD4,AE4,AF4,AG4,AH4)","v":"感染症予防のため7、"},null,"もしまとめたものが空白だったら、休んでいないいうことなので、１～３学期の遅刻早退があるか確認する。あれば特記事項なし、なければ皆勤。"]
[{"$f":"IF(名簿!$A3=\"\",\"\",名簿!$A3)","v":1103},{"$f":"IFERROR(VLOOKUP($A5,名簿!$A:$C,3,0),\"\")","v":"佐藤三郎"},56,0,0,0,0,0,null,{"$f":"IF(AT5=\"\",IF(OR('1学期'!AA5=\"あり\",'2学期'!AA5=\"あり\",AA5=\"あり\"),\"特記事項なし\",\"皆勤\"),IF(AND('1学期'!AA5=\"\",'2学期'!AA5=\"\",AA5=\"\",COUNTBLANK(AI5:AQ5)=COUNTA($AI$2:$AQ$2)),\"皆勤、\"&LEFT(AT5,LEN(AT5)-1),LEFT(AT5,LEN(AT5)-1)))","v":"皆勤、感染症予防のため1"},null,1,null,null,null,null,null,null,null,null,null,null,null,null,null,null,null,null,null,{"$f":"IF(AND(L5=\"\",'1学期'!L5=\"\",'2学期'!L5=\"\"),\"\",L$2&L5+'1学期'!L5+'2学期'!L5&\"、\")","v":"感染症予防のため1、"},{"$f":"IF(AND(M5=\"\",'1学期'!M5=\"\",'2学期'!M5=\"\"),\"\",M$2&M5+'1学期'!M5+'2学期'!M5&\"、\")","v":""},{"$f":"IF(AND(N5=\"\",'1学期'!N5=\"\",'2学期'!N5=\"\"),\"\",N$2&N5+'1学期'!N5+'2学期'!N5&\"、\")","v":""},{"$f":"IF(AND(O5=\"\",'1学期'!O5=\"\",'2学期'!O5=\"\"),\"\",O$2&O5+'1学期'!O5+'2学期'!O5&\"、\")","v":""},{"$f":"IF(AND(P5=\"\",'1学期'!P5=\"\",'2学期'!P5=\"\"),\"\",P$2&P5+'1学期'!P5+'2学期'!P5&\"、\")","v":""},{"$f":"IF(AND(Q5=\"\",'1学期'!Q5=\"\",'2学期'!Q5=\"\"),\"\",Q$2&Q5+'1学期'!Q5+'2学期'!Q5&\"、\")","v":""},{"$f":"IF(AND(R5=\"\",'1学期'!R5=\"\",'2学期'!R5=\"\"),\"\",R$2&R5+'1学期'!R5+'2学期'!R5&\"、\")","v":""},{"$f":"IF(AND(S5=\"\",'1学期'!S5=\"\",'2学期'!S5=\"\"),\"\",S$2&S5+'1学期'!S5+'2学期'!S5&\"、\")","v":""},{"$f":"IF(AND(T5=\"\",'1学期'!T5=\"\",'2学期'!T5=\"\"),\"\",T$2&T5+'1学期'!T5+'2学期'!T5&\"、\")","v":""},{"$f":"IF(AND(U5=\"\",'1学期'!U5=\"\",'2学期'!U5=\"\"),\"\",U$2&U5+'1学期'!U5+'2学期'!U5&\"、\")","v":""},{"$f":"IF(AND(V5=\"\",'1学期'!V5=\"\",'2学期'!V5=\"\"),\"\",V$2&V5+'1学期'!V5+'2学期'!V5&\"、\")","v":""},{"$f":"IF(AND(W5=\"\",'1学期'!W5=\"\",'2学期'!W5=\"\"),\"\",W$2&W5+'1学期'!W5+'2学期'!W5&\"、\")","v":""},{"$f":"IF(AND(X5=\"\",'1学期'!X5=\"\",'2学期'!X5=\"\"),\"\",X$2&X5+'1学期'!X5+'2学期'!X5&\"、\")","v":""},{"$f":"IF(AND(Y5=\"\",'1学期'!Y5=\"\",'2学期'!Y5=\"\"),\"\",Y$2&Y5+'1学期'!Y5+'2学期'!Y5&\"、\")","v":""},{"$f":"IF(AND(Z5=\"\",'1学期'!Z5=\"\",'2学期'!Z5=\"\"),\"\",Z$2&Z5+'1学期'!Z5+'2学期'!Z5&\"、\")","v":""},null,"感染症予防のため1、",null,"空白でなければ、休んだということだが、出席停止＆忌引きを確認する必要がある。１～３学期に遅刻がなく、体調不良などの欠席がなければ、「皆勤、祖父葬儀1」などと書かれるようにする。"]
[{"$f":"IF(名簿!$A4=\"\",\"\",名簿!$A4)","v":1104},{"$f":"IFERROR(VLOOKUP($A6,名簿!$A:$C,3,0),\"\")","v":"山田花子"},56,0,0,0,0,0,null,{"$f":"IF(AT6=\"\",IF(OR('1学期'!AA6=\"あり\",'2学期'!AA6=\"あり\",AA6=\"あり\"),\"特記事項なし\",\"皆勤\"),IF(AND('1学期'!AA6=\"\",'2学期'!AA6=\"\",AA6=\"\",COUNTBLANK(AI6:AQ6)=COUNTA($AI$2:$AQ$2)),\"皆勤、\"&LEFT(AT6,LEN(AT6)-1),LEFT(AT6,LEN(AT6)-1)))","v":"体調不良9、頭痛3、感染症のため3"},null,null,null,null,null,null,null,null,null,null,null,null,null,null,null,null,null,null,null,{"$f":"IF(AND(L6=\"\",'1学期'!L6=\"\",'2学期'!L6=\"\"),\"\",L$2&L6+'1学期'!L6+'2学期'!L6&\"、\")","v":""},{"$f":"IF(AND(M6=\"\",'1学期'!M6=\"\",'2学期'!M6=\"\"),\"\",M$2&M6+'1学期'!M6+'2学期'!M6&\"、\")","v":"感染症のため3、"},{"$f":"IF(AND(N6=\"\",'1学期'!N6=\"\",'2学期'!N6=\"\"),\"\",N$2&N6+'1学期'!N6+'2学期'!N6&\"、\")","v":""},{"$f":"IF(AND(O6=\"\",'1学期'!O6=\"\",'2学期'!O6=\"\"),\"\",O$2&O6+'1学期'!O6+'2学期'!O6&\"、\")","v":""},{"$f":"IF(AND(P6=\"\",'1学期'!P6=\"\",'2学期'!P6=\"\"),\"\",P$2&P6+'1学期'!P6+'2学期'!P6&\"、\")","v":""},{"$f":"IF(AND(Q6=\"\",'1学期'!Q6=\"\",'2学期'!Q6=\"\"),\"\",Q$2&Q6+'1学期'!Q6+'2学期'!Q6&\"、\")","v":"体調不良9、"},{"$f":"IF(AND(R6=\"\",'1学期'!R6=\"\",'2学期'!R6=\"\"),\"\",R$2&R6+'1学期'!R6+'2学期'!R6&\"、\")","v":""},{"$f":"IF(AND(S6=\"\",'1学期'!S6=\"\",'2学期'!S6=\"\"),\"\",S$2&S6+'1学期'!S6+'2学期'!S6&\"、\")","v":""},{"$f":"IF(AND(T6=\"\",'1学期'!T6=\"\",'2学期'!T6=\"\"),\"\",T$2&T6+'1学期'!T6+'2学期'!T6&\"、\")","v":"頭痛3、"},{"$f":"IF(AND(U6=\"\",'1学期'!U6=\"\",'2学期'!U6=\"\"),\"\",U$2&U6+'1学期'!U6+'2学期'!U6&\"、\")","v":""},{"$f":"IF(AND(V6=\"\",'1学期'!V6=\"\",'2学期'!V6=\"\"),\"\",V$2&V6+'1学期'!V6+'2学期'!V6&\"、\")","v":""},{"$f":"IF(AND(W6=\"\",'1学期'!W6=\"\",'2学期'!W6=\"\"),\"\",W$2&W6+'1学期'!W6+'2学期'!W6&\"、\")","v":""},{"$f":"IF(AND(X6=\"\",'1学期'!X6=\"\",'2学期'!X6=\"\"),\"\",X$2&X6+'1学期'!X6+'2学期'!X6&\"、\")","v":""},{"$f":"IF(AND(Y6=\"\",'1学期'!Y6=\"\",'2学期'!Y6=\"\"),\"\",Y$2&Y6+'1学期'!Y6+'2学期'!Y6&\"、\")","v":""},{"$f":"IF(AND(Z6=\"\",'1学期'!Z6=\"\",'2学期'!Z6=\"\"),\"\",Z$2&Z6+'1学期'!Z6+'2学期'!Z6&\"、\")","v":""},null,"体調不良9、頭痛3、感染症のため3、",null,"空白でなく、体調不良などの欠席があれば、そのまま入力するが、最後の「、」は消す。"]
{"$rows_left_out":40}
{"sheet":"出席簿に貼る","index":6,"n_rows":47,"n_cols":15,"rows_kept":47,"cut":false,"hidden":false,"merged":[]}
[]
[]
[]
[]
[]
[]
{"$rows_left_out":42}
{"sheet":"名簿","index":7,"n_rows":40,"n_cols":3,"rows_kept":40,"cut":false,"hidden":false,"merged":[]}
[1101,1,"田中太郎"]
[1102,2,"小林治郎"]
[1103,3,"佐藤三郎"]
[1104,4,"山田花子"]
[1105,5,"山本とし子"]
[1106,6]
{"$rows_left_out":34}